Target
Mu-type opioid receptor
Ligand
BDBM50027366
Substrate
IC50
8.40±n/a nM
Citation
 Duarte, FJAnand, NKSharma, PSingh, D Opioid agonists and uses thereof US Patent  US10865186 Publication Date 12/15/2020 
Target
Name:
Mu-type opioid receptor
Synonyms:
M-OR-1 MOR-1 MUOR1 Mu opiate receptor OPRM1 hMOP | mu-type opioid receptor isoform MOR-1
Type:
G Protein-Coupled Receptor (GPCR)
Mol. Mass.:
44789.51
Organism:
Homo sapiens (Human)
Description:
P35372
Residue:
400
  
Inhibitor
Name:
BDBM50027366
Synonyms:
Ketazocine US10865186, Compound Ketazocine WIN-34276
Type:
Small organic molecule
Emp. Form.:
C18H23NO2
Mol. Mass.:
285.3807
SMILES:
[H][C@@]12[C@H](C)[C@@](C)(CCN1CC1CC1)c1cc(O)ccc1C2=O
: