Target
Cyclin-dependent kinase 7
Ligand
BDBM475935
Substrate
Meas. Tech.
Kinase Activity Assay
IC50
<100±n/a nM
Citation
 Ciblat, SKabro, ALeblanc, MLeger, SMarineau, JJMiller, TRoy, SSchmidt, DSiddiqui, MASprott, KWinter, DKRipka, ALi, DZhang, G Inhibitors of cyclin-dependent kinase 7 (CDK7) US Patent  US10865206 Publication Date 12/15/2020 
Target
Name:
Cyclin-dependent kinase 7
Synonyms:
39 kDa protein kinase CAK1 CDK-activating kinase 1 (CAK) CDK7_HUMAN Cell division protein kinase 7 Cyclin-dependent kinase 7 (CDK7/cyclin H) P39 Mo15 TFIIH basal transcription factor complex kinase subunit
Type:
Enzyme Subunit
Mol. Mass.:
39047.01
Organism:
Homo sapiens (Human)
Description:
Residue:
346
  
Inhibitor
Name:
BDBM475935
Synonyms:
US10865206, Compound 101
Type:
Small organic molecule
Emp. Form.:
C25H25ClN6O2
Mol. Mass.:
476.958
SMILES:
Nc1ccc(cc1)C(=O)NC1CC(O)CC(C1)Nc1ncc(Cl)c(n1)-c1c[nH]c2ccccc12
: