Target
Cyclin-dependent kinase 7
Ligand
BDBM395707
Substrate
Meas. Tech.
Kinase Activity Assay
IC50
550±n/a nM
Citation
 Ciblat, SKabro, ALeblanc, MLeger, SMarineau, JJMiller, TRoy, SSchmidt, DSiddiqui, MASprott, KWinter, DKRipka, ALi, DZhang, G Inhibitors of cyclin-dependent kinase 7 (CDK7) US Patent  US10865206 Publication Date 12/15/2020 
Target
Name:
Cyclin-dependent kinase 7
Synonyms:
39 kDa protein kinase CAK1 CDK-activating kinase 1 (CAK) CDK7_HUMAN Cell division protein kinase 7 Cyclin-dependent kinase 7 (CDK7/cyclin H) P39 Mo15 TFIIH basal transcription factor complex kinase subunit
Type:
Enzyme Subunit
Mol. Mass.:
39047.01
Organism:
Homo sapiens (Human)
Description:
Residue:
346
  
Inhibitor
Name:
BDBM395707
Synonyms:
4-amino-N-((1S,3R)-3-(5-chloro-4-(1H-indol-3-yl)pyrimidin-2-ylamino)cyclohexyl)benzamide US10865206, Compound 102
Type:
Small organic molecule
Emp. Form.:
C25H25ClN6O
Mol. Mass.:
460.959
SMILES:
Nc1ccc(cc1)C(=O)N[C@H]1CCC[C@H](C1)Nc1ncc(Cl)c(n1)-c1c[nH]c2ccccc12
: