Target
Cyclin-dependent kinase 7
Ligand
BDBM395717
Substrate
Meas. Tech.
Kinase Activity Assay
IC50
550±n/a nM
Citation
 Ciblat, SKabro, ALeblanc, MLeger, SMarineau, JJMiller, TRoy, SSchmidt, DSiddiqui, MASprott, KWinter, DKRipka, ALi, DZhang, G Inhibitors of cyclin-dependent kinase 7 (CDK7) US Patent  US10865206 Publication Date 12/15/2020 
Target
Name:
Cyclin-dependent kinase 7
Synonyms:
39 kDa protein kinase CAK1 CDK-activating kinase 1 (CAK) CDK7_HUMAN Cell division protein kinase 7 Cyclin-dependent kinase 7 (CDK7/cyclin H) P39 Mo15 TFIIH basal transcription factor complex kinase subunit
Type:
Enzyme Subunit
Mol. Mass.:
39047.01
Organism:
Homo sapiens (Human)
Description:
Residue:
346
  
Inhibitor
Name:
BDBM395717
Synonyms:
4-amino-N-((1S,3R)-3-(5-chloro-4-(1H-indol-3-yl)pyrimidin-2-ylamino)cyclohexyl)-2-fluorobenzamide US10865206, Compound 112
Type:
Small organic molecule
Emp. Form.:
C25H24ClFN6O
Mol. Mass.:
478.949
SMILES:
Nc1ccc(C(=O)N[C@H]2CCC[C@H](C2)Nc2ncc(Cl)c(n2)-c2c[nH]c3ccccc23)c(F)c1
: