Target
Ubiquitin-like modifier-activating enzyme ATG7
Ligand
BDBM476123
Substrate
Meas. Tech.
Enzyme Assay
IC50
35±n/a nM
Citation
 Adhikari, SCalderwood, EFEngland, DBGould, AEHarrison, SJHuang, SMa, L ATG7 inhibitors and the uses thereof US Patent  US10865208 Publication Date 12/15/2020 
Target
Name:
Ubiquitin-like modifier-activating enzyme ATG7
Synonyms:
APG7-like ATG12-activating enzyme E1 ATG7 ATG7_HUMAN Ubiquitin-activating enzyme E1-like protein | hAGP7
Type:
PROTEIN
Mol. Mass.:
77955.74
Organism:
Homo sapiens (Human)
Description:
ChEMBL_939703
Residue:
703
  
Inhibitor
Name:
BDBM476123
Synonyms:
US10865208, Compound I-178 | [(2R,3S,5R)-5-{4-amino-3-[(2-fluoro-4-methoxyphenyl)sulfanyl]-1H- pyrazolo[3,4-d]pyrimidin-1-yl}-3-hydroxytetrahydrofuran-2-yl]methyl sulfamate
Type:
Small organic molecule
Emp. Form.:
C17H19FN6O6S2
Mol. Mass.:
486.498
SMILES:
COc1ccc(Sc2nn([C@H]3C[C@H](O)[C@@H](COS(N)(=O)=O)O3)c3ncnc(N)c23)c(F)c1
: