Target
Mitogen-activated protein kinase 14
Ligand
BDBM476196
Substrate
Meas. Tech.
Kinase Assay
IC50
11.0±2 nM
Citation
 Laco, FLow, JLOh, SChai, CLZhong, Q 2,4,5-tri-substituted azole-based casein kinase 1 inhibitors as inducers for cardiomyogenesis US Patent  US10865384 Publication Date 12/15/2020 
Target
Name:
Mitogen-activated protein kinase 14
Synonyms:
CSAID-binding protein CSBP1 CSPB1 MAP kinase 14 MAP kinase p38 alpha MAPK14 MK14_HUMAN Mitogen-activated protein kinase p38 alpha Stress-activated protein kinase 2a | p38 MAP kinase alpha/beta
Type:
Serine/threonine-protein kinase
Mol. Mass.:
41286.76
Organism:
Homo sapiens (Human)
Description:
Q16539
Residue:
360
  
Inhibitor
Name:
BDBM476196
Synonyms:
US10865384, Compound IM-43 | US10865384, Example 2s
Type:
Small organic molecule
Emp. Form.:
C22H23N3O
Mol. Mass.:
345.4375
SMILES:
Cc1cccc(c1)-c1nc([nH]c1-c1ccncc1)C(O)C1=CCCCC1
: