Target
Casein kinase I isoform epsilon
Ligand
BDBM476199
Substrate
Meas. Tech.
Kinase Assay
IC50
751±168 nM
Citation
 Laco, FLow, JLOh, SChai, CLZhong, Q 2,4,5-tri-substituted azole-based casein kinase 1 inhibitors as inducers for cardiomyogenesis US Patent  US10865384 Publication Date 12/15/2020 
Target
Name:
Casein kinase I isoform epsilon
Synonyms:
Axin-1/Casein kinase I epsilon CKIe Casein kinase 1 epsilon (CK1Ɛ) Casein kinase I isoform epsilon (CK1 epsilon) Casein kinase I isoform epsilon (CK1epsilon) | KC1E_HUMAN
Type:
Protein
Mol. Mass.:
47340.25
Organism:
Homo sapiens (Human)
Description:
P49674
Residue:
416
  
Inhibitor
Name:
BDBM476199
Synonyms:
US10865384, Compound IM-23 | US10865384, Example 3b
Type:
Small organic molecule
Emp. Form.:
C20H15F3N2O
Mol. Mass.:
356.3411
SMILES:
Fc1ccc(cc1)-c1nc([nH]c1C1=CCOCC1)-c1c(F)cccc1F
: