Target
Casein kinase I isoform epsilon
Ligand
BDBM50173609
Substrate
Meas. Tech.
LanthaScreen Eu Kinase Binding Assay
IC50
107±n/a nM
Citation
 Laco, FLow, JLOh, SChai, CLZhong, Q 2,4,5-tri-substituted azole-based casein kinase 1 inhibitors as inducers for cardiomyogenesis US Patent  US10865384 Publication Date 12/15/2020 
Target
Name:
Casein kinase I isoform epsilon
Synonyms:
Axin-1/Casein kinase I epsilon CKIe Casein kinase 1 epsilon (CK1Ɛ) Casein kinase I isoform epsilon (CK1 epsilon) Casein kinase I isoform epsilon (CK1epsilon) | KC1E_HUMAN
Type:
Protein
Mol. Mass.:
47340.25
Organism:
Homo sapiens (Human)
Description:
P49674
Residue:
416
  
Inhibitor
Name:
BDBM50173609
Synonyms:
CHEMBL363648 N-[4-(2-Ethyl-4-m-tolyl-thiazol-5-yl)-pyridin-2-yl]-benzamide | US10865384, Compound TAK-715
Type:
Small organic molecule
Emp. Form.:
C24H21N3OS
Mol. Mass.:
399.508
SMILES:
CCc1nc(c(s1)-c1ccnc(NC(=O)c2ccccc2)c1)-c1cccc(C)c1
: