Target
Acetylcholinesterase
Ligand
BDBM476178
Substrate
Meas. Tech.
AChE inhibition
EC50
62.0±n/a nM
Citation
 Becker, RE Compositions and methods for inhibiting brain trauma-induced neurodegeneration and related conditions US Patent  US10864192 Publication Date 12/15/2020 
Target
Name:
Acetylcholinesterase
Synonyms:
ACES_HUMAN Acetylcholinesterase (AChE) | Acetylcholinesterase (human AChE)
Type:
Enzyme
Mol. Mass.:
67792.70
Organism:
Homo sapiens (Human)
Description:
P22303
Residue:
614
  
Inhibitor
Name:
BDBM476178
Synonyms:
(−)-N8-norphenylcarbamoyleseroline | US10864192, Compound N-8 Nor P
Type:
Small organic molecule
Emp. Form.:
C19H21N3O2
Mol. Mass.:
323.3889
SMILES:
CN1CC[C@]2(C)[C@H]1Nc1ccc(OC(=O)Nc3ccccc3)cc21
: