Target
Cytochrome P450 26A1
Ligand
BDBM476221
Substrate
Meas. Tech.
Cell-Based Inhibitor Assay
IC50
8240±n/a nM
Citation
 Cameron, DAPetkovich, MRantanen, TKSnieckus, VBoard, JSingh, SMaheta, AJ Compounds and methods for inhibiting CYP26 enzymes US Patent  US10874634 Publication Date 12/29/2020 
Target
Name:
Cytochrome P450 26A1
Synonyms:
CP26A_HUMAN CYP26A1 Cytochrome P450 26A1 P450RAI1 | Retinoic acid 4-hydroxylase
Type:
Enzyme
Mol. Mass.:
56216.16
Organism:
Homo sapiens (Human)
Description:
O43174
Residue:
497
  
Inhibitor
Name:
BDBM476221
Synonyms:
US10874634, Cmpd No. 04B
Type:
Small organic molecule
Emp. Form.:
C24H34BrNO3S
Mol. Mass.:
496.501
SMILES:
COC(C)Cc1ccc(NS(=O)(=O)C2=CC3C(C=C2Br)C(C)(C)CCC3(C)C)cc1
: