Target
Cytochrome P450 26A1
Ligand
BDBM476229
Substrate
Meas. Tech.
Cell-Based Inhibitor Assay
IC50
20010±n/a nM
Citation
 Cameron, DAPetkovich, MRantanen, TKSnieckus, VBoard, JSingh, SMaheta, AJ Compounds and methods for inhibiting CYP26 enzymes US Patent  US10874634 Publication Date 12/29/2020 
Target
Name:
Cytochrome P450 26A1
Synonyms:
CP26A_HUMAN CYP26A1 Cytochrome P450 26A1 P450RAI1 | Retinoic acid 4-hydroxylase
Type:
Enzyme
Mol. Mass.:
56216.16
Organism:
Homo sapiens (Human)
Description:
O43174
Residue:
497
  
Inhibitor
Name:
BDBM476229
Synonyms:
US10874634, Cmpd No. 11
Type:
Small organic molecule
Emp. Form.:
C25H35NO4S
Mol. Mass.:
445.615
SMILES:
CC(C)c1cc(c(cc1S(=O)(=O)Nc1ccc(CC(O)=O)cc1)C(C)(C)C)C(C)(C)C
: