Target
Cytochrome P450 26A1
Ligand
BDBM476234
Substrate
Meas. Tech.
Cell-Based Inhibitor Assay
IC50
1774±n/a nM
Citation
 Cameron, DAPetkovich, MRantanen, TKSnieckus, VBoard, JSingh, SMaheta, AJ Compounds and methods for inhibiting CYP26 enzymes US Patent  US10874634 Publication Date 12/29/2020 
Target
Name:
Cytochrome P450 26A1
Synonyms:
CP26A_HUMAN CYP26A1 Cytochrome P450 26A1 P450RAI1 | Retinoic acid 4-hydroxylase
Type:
Enzyme
Mol. Mass.:
56216.16
Organism:
Homo sapiens (Human)
Description:
O43174
Residue:
497
  
Inhibitor
Name:
BDBM476234
Synonyms:
US10874634, Cmpd No. 16 | US11364220, Compound 16
Type:
Small organic molecule
Emp. Form.:
C26H33NO3
Mol. Mass.:
407.5451
SMILES:
Cc1cc2c(cc1C(=O)Nc1ccc(cc1)C(C)(C)C(O)=O)C(C)(C)CCC2(C)C
: