Target
Cytochrome P450 26B1
Ligand
BDBM476236
Substrate
Meas. Tech.
Cell-Based Inhibitor Assay
IC50
9066±n/a nM
Citation
 Cameron, DAPetkovich, MRantanen, TKSnieckus, VBoard, JSingh, SMaheta, AJ Compounds and methods for inhibiting CYP26 enzymes US Patent  US10874634 Publication Date 12/29/2020 
Target
Name:
Cytochrome P450 26B1
Synonyms:
CP26B_HUMAN CYP26A2 Cytochrome P450 26A2 Cytochrome P450 retinoic acid-inactivating 2 P450RAI2 | Retinoic acid-metabolizing cytochrome
Type:
PROTEIN
Mol. Mass.:
57525.03
Organism:
Homo sapiens (Human)
Description:
ChEMBL_115648
Residue:
512
  
Inhibitor
Name:
BDBM476236
Synonyms:
US10874634, Cmpd No. 18 | US11364220, Compound 18
Type:
Small organic molecule
Emp. Form.:
C27H37NO4S
Mol. Mass.:
471.652
SMILES:
CCC(CC)(C(O)=O)c1ccc(NS(=O)(=O)c2cc3c(cc2C)C(C)(C)CCC3(C)C)cc1
: