Target
Cytochrome P450 26A1
Ligand
BDBM476238
Substrate
Meas. Tech.
Cell-Based Inhibitor Assay
IC50
1900±n/a nM
Citation
 Cameron, DAPetkovich, MRantanen, TKSnieckus, VBoard, JSingh, SMaheta, AJ Compounds and methods for inhibiting CYP26 enzymes US Patent  US10874634 Publication Date 12/29/2020 
Target
Name:
Cytochrome P450 26A1
Synonyms:
CP26A_HUMAN CYP26A1 Cytochrome P450 26A1 P450RAI1 | Retinoic acid 4-hydroxylase
Type:
Enzyme
Mol. Mass.:
56216.16
Organism:
Homo sapiens (Human)
Description:
O43174
Residue:
497
  
Inhibitor
Name:
BDBM476238
Synonyms:
US10874634, Cmpd No. 21 | US11364220, Compound 21
Type:
Small organic molecule
Emp. Form.:
C21H27NO3S
Mol. Mass.:
373.509
SMILES:
Cc1ccc(NS(=O)(=O)c2cc(C)c3OC(C)(C)CC(C)(C)c3c2)cc1
: