Target
Capsid protein
Ligand
BDBM400028
Substrate
Meas. Tech.
HBV DNA Quantification Assay
EC50
5.80±n/a nM
Citation
 Du, JKaplan, JAKirschberg, TAKobayashi, TLazerwith, SELee, RAMedley, JWMitchell, MLMorganelli, PAPyun, HShevick, SLSquires, NHWatkins, WJ Substituted pyrrolizine compounds and uses thereof US Patent  US10874640 Publication Date 12/29/2020 
Target
Name:
Capsid protein
Synonyms:
C Core antigen HBcAg | p21.5
Type:
Enzyme Catalytic Domain
Mol. Mass.:
21105.01
Organism:
Hepatitis B virus genotype C subtype ayr (isolate Human/Japan/Okamoto/-) (HBV-C)
Description:
Residue:
183
  
Inhibitor
Name:
BDBM400028
Synonyms:
N-(3-chloro-4-fluorophenyl)-6-methyl-7-(2-oxo-2-((3-(trifluoromethyl)oxetan-3-yl)amino)acetyl)-2,3-dihydro-1H-pyrrolizine-5-carboxamide US10874640, Compound 7 | US20230270719, Compound 7
Type:
Small organic molecule
Emp. Form.:
C21H18ClF4N3O4
Mol. Mass.:
487.832
SMILES:
Cc1c(C(=O)C(=O)NC2(COC2)C(F)(F)F)c2CCCn2c1C(=O)Nc1ccc(F)c(Cl)c1
: