Target
Capsid protein
Ligand
BDBM476259
Substrate
Meas. Tech.
HBV DNA Quantification Assay
EC50
20.1±n/a nM
Citation
 Du, JKaplan, JAKirschberg, TAKobayashi, TLazerwith, SELee, RAMedley, JWMitchell, MLMorganelli, PAPyun, HShevick, SLSquires, NHWatkins, WJ Substituted pyrrolizine compounds and uses thereof US Patent  US10874640 Publication Date 12/29/2020 
Target
Name:
Capsid protein
Synonyms:
C Core antigen HBcAg | p21.5
Type:
Enzyme Catalytic Domain
Mol. Mass.:
21105.01
Organism:
Hepatitis B virus genotype C subtype ayr (isolate Human/Japan/Okamoto/-) (HBV-C)
Description:
Residue:
183
  
Inhibitor
Name:
BDBM476259
Synonyms:
N-(3-chloro-4-fluorophenyl)-6-methyl-7-(2-((3-methyl-1,1-dioxidothietan-3-yl)amino)-2-oxoacetyl)-2,3-dihydro-1H-pyrrolizine-5-carboxamide (21) US20230270719, Compound 21
Type:
Small organic molecule
Emp. Form.:
C21H21ClFN3O5S
Mol. Mass.:
481.925
SMILES:
Cc1c(C(=O)C(=O)NC2(C)CS(=O)(=O)C2)c2CCCn2c1C(=O)Nc1ccc(F)c(Cl)c1
: