Target
Capsid protein
Ligand
BDBM400045
Substrate
Meas. Tech.
HBV DNA Quantification Assay
EC50
66.0±n/a nM
Citation
 Du, JKaplan, JAKirschberg, TAKobayashi, TLazerwith, SELee, RAMedley, JWMitchell, MLMorganelli, PAPyun, HShevick, SLSquires, NHWatkins, WJ Substituted pyrrolizine compounds and uses thereof US Patent  US10874640 Publication Date 12/29/2020 
Target
Name:
Capsid protein
Synonyms:
C Core antigen HBcAg | p21.5
Type:
Enzyme Catalytic Domain
Mol. Mass.:
21105.01
Organism:
Hepatitis B virus genotype C subtype ayr (isolate Human/Japan/Okamoto/-) (HBV-C)
Description:
Residue:
183
  
Inhibitor
Name:
BDBM400045
Synonyms:
US10328053, Compound 23 US20230270719, Compound 23
Type:
Small organic molecule
Emp. Form.:
C24H24ClF3N4O4
Mol. Mass.:
524.92
SMILES:
CNC(=O)C1(CC(F)(F)C1)NC(=O)C(=O)c1c(C)c(C(=O)Nc2ccc(F)c(Cl)c2)n2[C@@H](C)CCc12
: