Target
Capsid protein
Ligand
BDBM400047
Substrate
Meas. Tech.
HBV DNA Quantification Assay
EC50
408±n/a nM
Citation
 Du, JKaplan, JAKirschberg, TAKobayashi, TLazerwith, SELee, RAMedley, JWMitchell, MLMorganelli, PAPyun, HShevick, SLSquires, NHWatkins, WJ Substituted pyrrolizine compounds and uses thereof US Patent  US10874640 Publication Date 12/29/2020 
Target
Name:
Capsid protein
Synonyms:
C Core antigen HBcAg | p21.5
Type:
Enzyme Catalytic Domain
Mol. Mass.:
21105.01
Organism:
Hepatitis B virus genotype C subtype ayr (isolate Human/Japan/Okamoto/-) (HBV-C)
Description:
Residue:
183
  
Inhibitor
Name:
BDBM400047
Synonyms:
US10328053, Compound 25 US20230270719, Compound 25
Type:
Small organic molecule
Emp. Form.:
C21H20ClF4N3O3
Mol. Mass.:
473.848
SMILES:
C[C@@H](NC(=O)C(=O)c1c(C)c(C(=O)Nc2ccc(F)c(Cl)c2)n2[C@@H](C)CCc12)C(F)(F)F
: