Target
Capsid protein
Ligand
BDBM400052
Substrate
Meas. Tech.
HBV DNA Quantification Assay
EC50
58.1±n/a nM
Citation
 Du, JKaplan, JAKirschberg, TAKobayashi, TLazerwith, SELee, RAMedley, JWMitchell, MLMorganelli, PAPyun, HShevick, SLSquires, NHWatkins, WJ Substituted pyrrolizine compounds and uses thereof US Patent  US10874640 Publication Date 12/29/2020 
Target
Name:
Capsid protein
Synonyms:
C Core antigen HBcAg | p21.5
Type:
Enzyme Catalytic Domain
Mol. Mass.:
21105.01
Organism:
Hepatitis B virus genotype C subtype ayr (isolate Human/Japan/Okamoto/-) (HBV-C)
Description:
Residue:
183
  
Inhibitor
Name:
BDBM400052
Synonyms:
(1aR,6aR)-N-(3-cyano-4-fluorophenyl)-5-(2-((3,3-difluoro-1-(methylcarbamoyl)cyclobutyl)amino)-2-oxoacetyl)-4-methyl-1,1a,6,6a-tetrahydrocyclopropa[b]pyrrolizine-3-carboxamide US10874640, Compound 30 | US20230270719, Compound 30
Type:
Small organic molecule
Emp. Form.:
C25H22F3N5O4
Mol. Mass.:
513.4685
SMILES:
CNC(=O)C1(CC(F)(F)C1)NC(=O)C(=O)c1c(C)c(C(=O)Nc2ccc(F)c(c2)C#N)n2[C@@H]3C[C@@H]3Cc12
: