Target
Capsid protein
Ligand
BDBM400088
Substrate
Meas. Tech.
HBV DNA Quantification Assay
EC50
6.50±n/a nM
Citation
 Du, JKaplan, JAKirschberg, TAKobayashi, TLazerwith, SELee, RAMedley, JWMitchell, MLMorganelli, PAPyun, HShevick, SLSquires, NHWatkins, WJ Substituted pyrrolizine compounds and uses thereof US Patent  US10874640 Publication Date 12/29/2020 
Target
Name:
Capsid protein
Synonyms:
C Core antigen HBcAg | p21.5
Type:
Enzyme Catalytic Domain
Mol. Mass.:
21105.01
Organism:
Hepatitis B virus genotype C subtype ayr (isolate Human/Japan/Okamoto/-) (HBV-C)
Description:
Residue:
183
  
Inhibitor
Name:
BDBM400088
Synonyms:
N-(3-chloro-4-fluorophenyl)-6-methyl-7-(2-oxo-2-((1-phenylcyclopropyl)amino)acetyl)-2,3-dihydro-1H-pyrrolizine-5-carboxamide US10874640, Compound 66 | US20230270719, Compound 66
Type:
Small organic molecule
Emp. Form.:
C26H23ClFN3O3
Mol. Mass.:
479.931
SMILES:
Cc1c(C(=O)C(=O)NC2(CC2)c2ccccc2)c2CCCn2c1C(=O)Nc1ccc(F)c(Cl)c1
: