Target
Capsid protein
Ligand
BDBM400094
Substrate
Meas. Tech.
HBV DNA Quantification Assay
EC50
69.8±n/a nM
Citation
 Du, JKaplan, JAKirschberg, TAKobayashi, TLazerwith, SELee, RAMedley, JWMitchell, MLMorganelli, PAPyun, HShevick, SLSquires, NHWatkins, WJ Substituted pyrrolizine compounds and uses thereof US Patent  US10874640 Publication Date 12/29/2020 
Target
Name:
Capsid protein
Synonyms:
C Core antigen HBcAg | p21.5
Type:
Enzyme Catalytic Domain
Mol. Mass.:
21105.01
Organism:
Hepatitis B virus genotype C subtype ayr (isolate Human/Japan/Okamoto/-) (HBV-C)
Description:
Residue:
183
  
Inhibitor
Name:
BDBM400094
Synonyms:
(1aR,6aR)-N-(3-cyano-4-fluorophenyl)-4-methyl-5-(2-((3-methyl-1,1-dioxidothietan-3-yl)amino)-2-oxoacetyl)-1,1a,6,6a-tetrahydrocyclopropa[b]pyrrolizine-3-carboxamide US10874640, Compound 72 | US20230270719, Compound 72
Type:
Small organic molecule
Emp. Form.:
C23H21FN4O5S
Mol. Mass.:
484.5
SMILES:
Cc1c(C(=O)C(=O)NC2(C)CS(=O)(=O)C2)c2C[C@H]3C[C@H]3n2c1C(=O)Nc1ccc(F)c(c1)C#N
: