Target
Capsid protein
Ligand
BDBM400096
Substrate
Meas. Tech.
HBV DNA Quantification Assay
EC50
42.0±n/a nM
Citation
 Du, JKaplan, JAKirschberg, TAKobayashi, TLazerwith, SELee, RAMedley, JWMitchell, MLMorganelli, PAPyun, HShevick, SLSquires, NHWatkins, WJ Substituted pyrrolizine compounds and uses thereof US Patent  US10874640 Publication Date 12/29/2020 
Target
Name:
Capsid protein
Synonyms:
C Core antigen HBcAg | p21.5
Type:
Enzyme Catalytic Domain
Mol. Mass.:
21105.01
Organism:
Hepatitis B virus genotype C subtype ayr (isolate Human/Japan/Okamoto/-) (HBV-C)
Description:
Residue:
183
  
Inhibitor
Name:
BDBM400096
Synonyms:
7-(2-((1-(1H-1,2,3-triazol-4-yl)cyclopropyl)amino)-2-oxoacetyl)-N-(3-chlorophenyl)-6-methyl-2,3-dihydro-1H-pyrrolizine-5-carboxamide US10874640, Compound 74 | US20230270719, Compound 74
Type:
Small organic molecule
Emp. Form.:
C22H21ClN6O3
Mol. Mass.:
452.894
SMILES:
Cc1c(C(=O)C(=O)NC2(CC2)c2c[nH]nn2)c2CCCn2c1C(=O)Nc1cccc(Cl)c1
: