Target
Capsid protein
Ligand
BDBM400100
Substrate
Meas. Tech.
HBV DNA Quantification Assay
EC50
16.4±n/a nM
Citation
 Du, JKaplan, JAKirschberg, TAKobayashi, TLazerwith, SELee, RAMedley, JWMitchell, MLMorganelli, PAPyun, HShevick, SLSquires, NHWatkins, WJ Substituted pyrrolizine compounds and uses thereof US Patent  US10874640 Publication Date 12/29/2020 
Target
Name:
Capsid protein
Synonyms:
C Core antigen HBcAg | p21.5
Type:
Enzyme Catalytic Domain
Mol. Mass.:
21105.01
Organism:
Hepatitis B virus genotype C subtype ayr (isolate Human/Japan/Okamoto/-) (HBV-C)
Description:
Residue:
183
  
Inhibitor
Name:
BDBM400100
Synonyms:
(1aR,6aR)-5-(2-((3,3-difluoro-1-(1H-1,2,3-triazol-4-yl)cyclobutyl)amino)-2-oxoacetyl)-N-(2-(difluoromethyl)pyridin-4-yl)-4-methyl-1,1a,6,6a-tetrahydrocyclopropa[b]pyrrolizine-3-carboxamide US10874640, Compound 78 | US20230270719, Compound 78
Type:
Small organic molecule
Emp. Form.:
C24H21F4N7O3
Mol. Mass.:
531.4623
SMILES:
Cc1c(C(=O)C(=O)NC2(CC(F)(F)C2)c2c[nH]nn2)c2C[C@H]3C[C@H]3n2c1C(=O)Nc1ccnc(c1)C(F)F
: