Target
Capsid protein
Ligand
BDBM400112
Substrate
Meas. Tech.
HBV DNA Quantification Assay
EC50
183±n/a nM
Citation
 Du, JKaplan, JAKirschberg, TAKobayashi, TLazerwith, SELee, RAMedley, JWMitchell, MLMorganelli, PAPyun, HShevick, SLSquires, NHWatkins, WJ Substituted pyrrolizine compounds and uses thereof US Patent  US10874640 Publication Date 12/29/2020 
Target
Name:
Capsid protein
Synonyms:
C Core antigen HBcAg | p21.5
Type:
Enzyme Catalytic Domain
Mol. Mass.:
21105.01
Organism:
Hepatitis B virus genotype C subtype ayr (isolate Human/Japan/Okamoto/-) (HBV-C)
Description:
Residue:
183
  
Inhibitor
Name:
BDBM400112
Synonyms:
7-(2-((1-(1H-1,2,3-triazol-4-yl)cyclopropyl)amino)-2-oxoacetyl)-6-methyl-N-(2,4,5-trifluorophenyl)-2,3-dihydro-1H-pyrrolizine-5-carboxamide US10874640, Compound 90 | US20230270719, Compound 90
Type:
Small organic molecule
Emp. Form.:
C22H19F3N6O3
Mol. Mass.:
472.4199
SMILES:
Cc1c(C(=O)C(=O)NC2(CC2)c2c[nH]nn2)c2CCCn2c1C(=O)Nc1cc(F)c(F)cc1F
: