Target
Capsid protein
Ligand
BDBM400146
Substrate
Meas. Tech.
HBV DNA Quantification Assay
EC50
10.4±n/a nM
Citation
 Du, JKaplan, JAKirschberg, TAKobayashi, TLazerwith, SELee, RAMedley, JWMitchell, MLMorganelli, PAPyun, HShevick, SLSquires, NHWatkins, WJ Substituted pyrrolizine compounds and uses thereof US Patent  US10874640 Publication Date 12/29/2020 
Target
Name:
Capsid protein
Synonyms:
C Core antigen HBcAg | p21.5
Type:
Enzyme Catalytic Domain
Mol. Mass.:
21105.01
Organism:
Hepatitis B virus genotype C subtype ayr (isolate Human/Japan/Okamoto/-) (HBV-C)
Description:
Residue:
183
  
Inhibitor
Name:
BDBM400146
Synonyms:
N-(3-chloro-4-fluorophenyl)-7-(2-((1-cyano-3,3-difluorocyclobutyl)amino)-2-oxoacetyl)-6-methyl-2,3-dihydro-1H-pyrrolizine-5-carboxamide US10874640, Compound 130 | US20230270719, Compound 130
Type:
Small organic molecule
Emp. Form.:
C22H18ClF3N4O3
Mol. Mass.:
478.852
SMILES:
Cc1c(C(=O)C(=O)NC2(CC(F)(F)C2)C#N)c2CCCn2c1C(=O)Nc1ccc(F)c(Cl)c1
: