Target
D(3) dopamine receptor
Ligand
BDBM476247
Substrate
Meas. Tech.
radioligand competition assay
Ki
15.8±2.0 nM
Citation
 Dutta, AK Neuroprotective agents for treatment of neurodegenerative diseases US Patent  US10874669 Publication Date 12/29/2020 
Target
Name:
D(3) dopamine receptor
Synonyms:
DOPAMINE D3 DRD3_HUMAN Dopamine D3 receptor (D3) Dopamine receptor Dopamine receptor D3
Type:
Mol. Mass.:
44243.43
Organism:
Homo sapiens (Human)
Description:
Residue:
400
  
Inhibitor
Name:
BDBM476247
Synonyms:
4-(3-((2-Amino-4,5,6,7-tetrahydrobenzo[d]thiazol-6-yl)(propyl)amino)propyl)-2-methoxyphenol | US10874669, Compound 22 (D-547)
Type:
Small organic molecule
Emp. Form.:
C20H29N3O2S
Mol. Mass.:
375.528
SMILES:
COc1cc(CCCNCCCC2CCc3nc(N)sc3C2)ccc1O
: