Target
D(2) dopamine receptor
Ligand
BDBM476248
Substrate
Meas. Tech.
radioligand competition assay
Ki
175±8 nM
Citation
 Dutta, AK Neuroprotective agents for treatment of neurodegenerative diseases US Patent  US10874669 Publication Date 12/29/2020 
Target
Name:
D(2) dopamine receptor
Synonyms:
D(2) dopamine receptor DOPAMINE D2 Long DRD2 Dopamine D2 receptor Dopamine D2 receptor (D2R) Dopamine2-like | d2
Type:
Cell-surface receptors
Mol. Mass.:
50647.10
Organism:
Homo sapiens (Human)
Description:
P14416
Residue:
443
  
Inhibitor
Name:
BDBM476248
Synonyms:
US10874669, Compound 23 (D-548)
Type:
Small organic molecule
Emp. Form.:
C22H33N3O2S
Mol. Mass.:
403.581
SMILES:
COc1cc(CCCCCNCCC[C@H]2CCc3nc(N)sc3C2)ccc1O
: