Target
D(3) dopamine receptor
Ligand
BDBM476248
Substrate
Meas. Tech.
radioligand competition assay
Ki
3.62±0.78 nM
Comments
Zero 01/04/2022
Citation
 Dutta, AK Neuroprotective agents for treatment of neurodegenerative diseases US Patent  US10874669 Publication Date 12/29/2020 
Target
Name:
D(3) dopamine receptor
Synonyms:
DOPAMINE D3 DRD3_HUMAN Dopamine D3 receptor (D3) Dopamine receptor Dopamine receptor D3
Type:
Mol. Mass.:
44243.43
Organism:
Homo sapiens (Human)
Description:
Residue:
400
  
Inhibitor
Name:
BDBM476248
Synonyms:
US10874669, Compound 23 (D-548)
Type:
Small organic molecule
Emp. Form.:
C22H33N3O2S
Mol. Mass.:
403.581
SMILES:
COc1cc(CCCCCNCCC[C@H]2CCc3nc(N)sc3C2)ccc1O
: