Target
D(3) dopamine receptor
Ligand
BDBM476249
Substrate
Meas. Tech.
radioligand competition assay
Ki
1.57±0.41 nM
Citation
 Dutta, AK Neuroprotective agents for treatment of neurodegenerative diseases US Patent  US10874669 Publication Date 12/29/2020 
Target
Name:
D(3) dopamine receptor
Synonyms:
DOPAMINE D3 DRD3_HUMAN Dopamine D3 receptor (D3) Dopamine receptor Dopamine receptor D3
Type:
Mol. Mass.:
44243.43
Organism:
Homo sapiens (Human)
Description:
Residue:
400
  
Inhibitor
Name:
BDBM476249
Synonyms:
4-(5-((2-Amino-4,5,6,7-tetrahydrobenzo[d]thiazol-6-yl)(propyl)amino)pentyl)-2-methoxyphenol | US10874669, Compound (-) 23 (D-591)
Type:
Small organic molecule
Emp. Form.:
C22H33N3O2S
Mol. Mass.:
403.581
SMILES:
COc1cc(CCCCCNCCC[C@@H]2CCc3nc(N)sc3C2)ccc1O
: