Target
D(2) dopamine receptor
Ligand
BDBM476254
Substrate
Meas. Tech.
radioligand competition assay
Ki
233±8 nM
Citation
 Dutta, AK Neuroprotective agents for treatment of neurodegenerative diseases US Patent  US10874669 Publication Date 12/29/2020 
Target
Name:
D(2) dopamine receptor
Synonyms:
D(2) dopamine receptor DOPAMINE D2 Long DRD2 Dopamine D2 receptor Dopamine D2 receptor (D2R) Dopamine2-like | d2
Type:
Cell-surface receptors
Mol. Mass.:
50647.10
Organism:
Homo sapiens (Human)
Description:
P14416
Residue:
443
  
Inhibitor
Name:
BDBM476254
Synonyms:
(Z)-4-(5-((2-amino-4,5,6,7-tetrahydrobenzo[d]thiazol-6-yl)(propyl)amino)pent-1-en-1-yl)-2-methoxyphenol | US10874669, Compound 39 (D-567)
Type:
Small organic molecule
Emp. Form.:
C22H31N3O2S
Mol. Mass.:
401.565
SMILES:
COc1cc(\C=C\CCCNCCCC2CCc3nc(N)sc3C2)ccc1O
: