Target
D(2) dopamine receptor
Ligand
BDBM476255
Substrate
Meas. Tech.
radioligand competition assay
Ki
121±21 nM
Citation
 Dutta, AK Neuroprotective agents for treatment of neurodegenerative diseases US Patent  US10874669 Publication Date 12/29/2020 
Target
Name:
D(2) dopamine receptor
Synonyms:
D(2) dopamine receptor DOPAMINE D2 Long DRD2 Dopamine D2 receptor Dopamine D2 receptor (D2R) Dopamine2-like | d2
Type:
Cell-surface receptors
Mol. Mass.:
50647.10
Organism:
Homo sapiens (Human)
Description:
P14416
Residue:
443
  
Inhibitor
Name:
BDBM476255
Synonyms:
(Z)-4-(5-((2-amino-4,5,6,7-tetrahydrobenzo[d]thiazol-6-yl)(propyl)amino)pent-1-en-1-yl)benzene-1,2-diol | US10874669, Compound 46 (D-592)
Type:
Small organic molecule
Emp. Form.:
C21H29N3O2S
Mol. Mass.:
387.539
SMILES:
Nc1nc2CCC(CCCNCCC\C=C\c3ccc(O)c(O)c3)Cc2s1
: