Target
Replicase polyprotein 1ab
Ligand
BDBM476337
Substrate
Meas. Tech.
Activity of Compound 1A and 1B Against Coronavirus in MES-21 Cells
EC50
2000±n/a nM
Citation
 Sommadossi, JMoussa, A Highly active compounds against COVID-19 US Patent  US10874687 Publication Date 12/29/2020 
Target
Name:
Replicase polyprotein 1ab
Synonyms:
ORF1ab polyprotein pp1ab | rep
Type:
Protein
Mol. Mass.:
797943.10
Organism:
HCoV-OC43
Description:
P0C6X6
Residue:
7095
  
Inhibitor
Name:
BDBM476337
Synonyms:
US10874687, Compound 1A
Type:
Small organic molecule
Emp. Form.:
C24H33FN7O7P
Mol. Mass.:
581.5337
SMILES:
CNc1nc(N)nc2n(cnc12)[C@@H]1O[C@H](CO[P@@](=O)(N[C@@H](C)C(=O)OC(C)C)Oc2ccccc2)[C@@H](O)[C@@]1(C)F
: