Target
Coagulation factor XII
Ligand
BDBM476350
Substrate
Meas. Tech.
Factor XIIa Assay
IC50
5.80±n/a nM
Citation
 Rao, AUMcKittrick, BALombardo, MHicks, JDBittner McCracken, AChu, HDSo, SOrth, PWu, ZLan, PDebenham, JSWhitehead, BRTaylor, JASun, ZKatipally, RRGable, JEDahlgren, MKBhat, SP Factor XIIa inhibitors US Patent  US10875851 Publication Date 12/29/2020 
Target
Name:
Coagulation factor XII
Synonyms:
Beta-factor XIIa part 1 Carboxylesterase 2 (intestine, liver) Coagulation factor XII (FXII) Coagulation factor XIIa light chain FA12_HUMAN Factor XIIa (fXIIa) Hageman factor
Type:
Enzyme
Mol. Mass.:
67810.07
Organism:
Homo sapiens (Human)
Description:
P00748
Residue:
615
  
Inhibitor
Name:
BDBM476350
Synonyms:
2-chlorophenyl (3S)-4-[N-(2-benzyl- 2-azaspiro[4.5]dec-8-yl)-3- cyclohexyl-D-alanyl]-3-[(thiophen-2- ylmethyl)carbamoyl]piperazine-1- carboxylate US10875851, Example 14 | US10875851, Example 6
Type:
Small organic molecule
Emp. Form.:
C42H54ClN5O4S
Mol. Mass.:
760.427
SMILES:
Clc1ccccc1OC(=O)N1CCN([C@@H](C1)C(=O)NCc1cccs1)C(=O)[C@@H](CC1CCCCC1)NC1CCC2(CCN(Cc3ccccc3)C2)CC1
: