Target
Coagulation factor XII
Ligand
BDBM476412
Substrate
Meas. Tech.
Factor XIIa Assay
IC50
15.7±n/a nM
Citation
 Rao, AUMcKittrick, BALombardo, MHicks, JDBittner McCracken, AChu, HDSo, SOrth, PWu, ZLan, PDebenham, JSWhitehead, BRTaylor, JASun, ZKatipally, RRGable, JEDahlgren, MKBhat, SP Factor XIIa inhibitors US Patent  US10875851 Publication Date 12/29/2020 
Target
Name:
Coagulation factor XII
Synonyms:
Beta-factor XIIa part 1 Carboxylesterase 2 (intestine, liver) Coagulation factor XII (FXII) Coagulation factor XIIa light chain FA12_HUMAN Factor XIIa (fXIIa) Hageman factor
Type:
Enzyme
Mol. Mass.:
67810.07
Organism:
Homo sapiens (Human)
Description:
P00748
Residue:
615
  
Inhibitor
Name:
BDBM476412
Synonyms:
2-chlorophenyl (3S)-4-{(2R)-2- (cyclohexylamino)-2-[1-(1,3-thiazol- 4-ylcarbonyl)piperidin-4-yl]acetyl}-3- [(thiophen-2- ylmethyl)carbamoyl]piperazine-1- carboxylate | US10875851, Example 68
Type:
Small organic molecule
Emp. Form.:
C34H41ClN6O5S2
Mol. Mass.:
713.31
SMILES:
Clc1ccccc1OC(=O)N1CCN([C@@H](C1)C(=O)NCc1cccs1)C(=O)[C@H](NC1CCCCC1)C1CCN(CC1)C(=O)c1cscn1
: