Target
Coagulation factor XII
Ligand
BDBM476427
Substrate
Meas. Tech.
Factor XIIa Assay
IC50
28.4±n/a nM
Citation
 Rao, AUMcKittrick, BALombardo, MHicks, JDBittner McCracken, AChu, HDSo, SOrth, PWu, ZLan, PDebenham, JSWhitehead, BRTaylor, JASun, ZKatipally, RRGable, JEDahlgren, MKBhat, SP Factor XIIa inhibitors US Patent  US10875851 Publication Date 12/29/2020 
Target
Name:
Coagulation factor XII
Synonyms:
Beta-factor XIIa part 1 Carboxylesterase 2 (intestine, liver) Coagulation factor XII (FXII) Coagulation factor XIIa light chain FA12_HUMAN Factor XIIa (fXIIa) Hageman factor
Type:
Enzyme
Mol. Mass.:
67810.07
Organism:
Homo sapiens (Human)
Description:
P00748
Residue:
615
  
Inhibitor
Name:
BDBM476427
Synonyms:
1-chloronaphthalen-2-yl (3S)-3-{[4- (aminomethyl)-3- methoxybenzyl]carbamoyl}-4-[N6- (methylsulfonyl)-D-lysyl]piperazine- 1-carboxylate | US10875851, Example 83
Type:
Small organic molecule
Emp. Form.:
C32H41ClN6O7S
Mol. Mass.:
689.222
SMILES:
COc1cc(CNC(=O)[C@@H]2CN(CCN2C(=O)[C@H](N)CCCCNS(C)(=O)=O)C(=O)Oc2ccc3ccccc3c2Cl)ccc1CN
: