Target
Coagulation factor XII
Ligand
BDBM476446
Substrate
Meas. Tech.
Factor XIIa Assay
IC50
0.700±n/a nM
Citation
 Rao, AUMcKittrick, BALombardo, MHicks, JDBittner McCracken, AChu, HDSo, SOrth, PWu, ZLan, PDebenham, JSWhitehead, BRTaylor, JASun, ZKatipally, RRGable, JEDahlgren, MKBhat, SP Factor XIIa inhibitors US Patent  US10875851 Publication Date 12/29/2020 
Target
Name:
Coagulation factor XII
Synonyms:
Beta-factor XIIa part 1 Carboxylesterase 2 (intestine, liver) Coagulation factor XII (FXII) Coagulation factor XIIa light chain FA12_HUMAN Factor XIIa (fXIIa) Hageman factor
Type:
Enzyme
Mol. Mass.:
67810.07
Organism:
Homo sapiens (Human)
Description:
P00748
Residue:
615
  
Inhibitor
Name:
BDBM476446
Synonyms:
2-chloro-3,4-dimethylphenyl (3S)-4- [N2-cyclohexyl-N6-(1-methylethyl)-D- lysyl]-3-[(thiophen-2- ylmethyl)carbamoyl]piperazine-1- carboxylate | US10875851, Example 102
Type:
Small organic molecule
Emp. Form.:
C34H50ClN5O4S
Mol. Mass.:
660.31
SMILES:
CC(C)NCCCC[C@@H](NC1CCCCC1)C(=O)N1CCN(C[C@H]1C(=O)NCc1cccs1)C(=O)Oc1ccc(C)c(C)c1Cl
: