Target
Coagulation factor XII
Ligand
BDBM476498
Substrate
Meas. Tech.
Factor XIIa Assay
IC50
12.4±n/a nM
Citation
 Rao, AUMcKittrick, BALombardo, MHicks, JDBittner McCracken, AChu, HDSo, SOrth, PWu, ZLan, PDebenham, JSWhitehead, BRTaylor, JASun, ZKatipally, RRGable, JEDahlgren, MKBhat, SP Factor XIIa inhibitors US Patent  US10875851 Publication Date 12/29/2020 
Target
Name:
Coagulation factor XII
Synonyms:
Beta-factor XIIa part 1 Carboxylesterase 2 (intestine, liver) Coagulation factor XII (FXII) Coagulation factor XIIa light chain FA12_HUMAN Factor XIIa (fXIIa) Hageman factor
Type:
Enzyme
Mol. Mass.:
67810.07
Organism:
Homo sapiens (Human)
Description:
P00748
Residue:
615
  
Inhibitor
Name:
BDBM476498
Synonyms:
(2S)-N-(4-carbamoyl-3- methoxybenzyl)-4-[(5S)-4,4-dimethyl- 5-phenyl-4,5-dihydro-1,3-oxazol-2- yl]-1-(N2,N2,N6,N6-tetramethyl-D- lysyl)piperazine-2-carboxamide | US10875851, Example 154
Type:
Small organic molecule
Emp. Form.:
C35H51N7O5
Mol. Mass.:
649.8233
SMILES:
COc1cc(CNC(=O)[C@@H]2CN(CCN2C(=O)[C@@H](CCCCN(C)C)N(C)C)C2=NC(C)(C)[C@@H](O2)c2ccccc2)ccc1C(N)=O
: