Target
Coagulation factor XII
Ligand
BDBM476511
Substrate
Meas. Tech.
Factor XIIa Assay
IC50
36.1±n/a nM
Citation
 Rao, AUMcKittrick, BALombardo, MHicks, JDBittner McCracken, AChu, HDSo, SOrth, PWu, ZLan, PDebenham, JSWhitehead, BRTaylor, JASun, ZKatipally, RRGable, JEDahlgren, MKBhat, SP Factor XIIa inhibitors US Patent  US10875851 Publication Date 12/29/2020 
Target
Name:
Coagulation factor XII
Synonyms:
Beta-factor XIIa part 1 Carboxylesterase 2 (intestine, liver) Coagulation factor XII (FXII) Coagulation factor XIIa light chain FA12_HUMAN Factor XIIa (fXIIa) Hageman factor
Type:
Enzyme
Mol. Mass.:
67810.07
Organism:
Homo sapiens (Human)
Description:
P00748
Residue:
615
  
Inhibitor
Name:
BDBM476511
Synonyms:
(2S)-4-[(4S,5S)-5-(3-bromophenyl)-4- methyl-4,5-dihydro-1,3-oxazol-2-yl]- N-(3-chlorobenzyl)-1-(6-piperidin-1- yl-D-norleucyl)piperazine-2- carboxamide | US10875851, Example 167
Type:
Small organic molecule
Emp. Form.:
C33H44BrClN6O3
Mol. Mass.:
688.098
SMILES:
C[C@@H]1N=C(O[C@H]1c1cccc(Br)c1)N1CCN([C@@H](C1)C(=O)NCc1cccc(Cl)c1)C(=O)[C@H](N)CCCCN1CCCCC1
: