Target
Coagulation factor XII
Ligand
BDBM476523
Substrate
Meas. Tech.
Factor XIIa Assay
IC50
1.70±n/a nM
Citation
 Rao, AUMcKittrick, BALombardo, MHicks, JDBittner McCracken, AChu, HDSo, SOrth, PWu, ZLan, PDebenham, JSWhitehead, BRTaylor, JASun, ZKatipally, RRGable, JEDahlgren, MKBhat, SP Factor XIIa inhibitors US Patent  US10875851 Publication Date 12/29/2020 
Target
Name:
Coagulation factor XII
Synonyms:
Beta-factor XIIa part 1 Carboxylesterase 2 (intestine, liver) Coagulation factor XII (FXII) Coagulation factor XIIa light chain FA12_HUMAN Factor XIIa (fXIIa) Hageman factor
Type:
Enzyme
Mol. Mass.:
67810.07
Organism:
Homo sapiens (Human)
Description:
P00748
Residue:
615
  
Inhibitor
Name:
BDBM476523
Synonyms:
(2S)-N-[4-(aminomethyl)-3- chlorobenzyl]-1-[N-(1-methylethyl)-6- piperidin-1-yl-D-norleucyl]-4- [(4S,5S)-4-methyl-5-phenyl-4,5- dihydro-1,3-oxazol-2-yl]piperazine-2- carboxamide | US10875851, Example 179
Type:
Small organic molecule
Emp. Form.:
C37H54ClN7O3
Mol. Mass.:
680.323
SMILES:
CC(C)N[C@H](CCCCN1CCCCC1)C(=O)N1CCN(C[C@H]1C(=O)NCc1ccc(CN)c(Cl)c1)C1=N[C@@H](C)[C@@H](O1)c1ccccc1
: