Target
Histone deacetylase 3
Ligand
BDBM476609
Substrate
Meas. Tech.
Inhibition Assay
IC50
>10000±n/a nM
Citation
 Chou, CJMcClure, JZhang, CInks, E Histone deacetylase inhibitors and uses thereof US Patent  US10870618 Publication Date 12/22/2020 
Target
Name:
Histone deacetylase 3
Synonyms:
HD3 HDAC3_HUMAN Human HDAC3 SMAP45
Type:
Enzyme
Mol. Mass.:
48829.55
Organism:
Homo sapiens (Human)
Description:
O15379
Residue:
428
  
Inhibitor
Name:
BDBM476609
Synonyms:
N-(4-(2-isopropylhydrazine-1- carbonyl)benzyl)benzamide | US10870618, Compound 2b
Type:
Small organic molecule
Emp. Form.:
C18H21N3O2
Mol. Mass.:
311.3782
SMILES:
CC(C)NNC(=O)c1ccc(CNC(=O)c2ccccc2)cc1
: