Target
Beta-secretase 1
Ligand
BDBM476673
Substrate
Meas. Tech.
Potency Activity Assay
IC50
48.0±n/a nM
Citation
 Cherukury, MLin, HYu, SCPhang, RRajan, YCTang-Liu, DDWhite, ADMalone, TBeresis, R Compounds and their use as BACE1 inhibitors US Patent  US10870635 Publication Date 12/22/2020 
Target
Name:
Beta-secretase 1
Synonyms:
ASP2 Aspartyl protease 2 BACE1 Beta-secretase (BACE) Beta-secretase 1 (BACE 1) Beta-secretase 1 (BACE1) Beta-site amyloid precursor protein cleaving enzyme 1 Memapsin-2 beta-Secretase (BACE-1) | beta-Secretase (BACE1)
Type:
Protein
Mol. Mass.:
55755.10
Organism:
Homo sapiens (Human)
Description:
P56817
Residue:
501
  
Inhibitor
Name:
BDBM476673
Synonyms:
(6S)-2-Imino-3,6-dimethyl-6-(5-oxido-8- (prop-1-yn-1-yl)dibenzo[b,d]thiophen- 2-yl)tetrahydropyrimidin-4(1H)-one | US10870635, Example 80
Type:
Small organic molecule
Emp. Form.:
C21H19N3O2S
Mol. Mass.:
377.459
SMILES:
CC#Cc1ccc2c(c1)c1cc(ccc1s2=O)[C@]1(C)CC(=O)N(C)C(=N)N1
: