Target
Beta-secretase 2
Ligand
BDBM476688
Substrate
Meas. Tech.
Activity Assay
IC50
12.0±n/a nM
Citation
 Cherukury, MLin, HYu, SCPhang, RRajan, YCTang-Liu, DDWhite, ADMalone, TBeresis, R Compounds and their use as BACE1 inhibitors US Patent  US10870635 Publication Date 12/22/2020 
Target
Name:
Beta-secretase 2
Synonyms:
AEPLC ASP1 Asp 1 Aspartyl protease 1 BACE2_HUMAN Beta-secretase (BACE) Beta-secretase 2 (BACE-2) Beta-site APP-cleaving enzyme 2 Memapsin-1 beta-Secretase (BACE-2)
Type:
Protein
Mol. Mass.:
56171.20
Organism:
Homo sapiens (Human)
Description:
Q9Y5Z0
Residue:
518
  
Inhibitor
Name:
BDBM476688
Synonyms:
(R)-3-Imino-2,2,5-trimethyl-5-(8- (prop-1-yn-1-yl)dibenzo[b,d]thiophen- 2-yl)thiomorpholine 1,1-dioxide | US10870635, Example 103
Type:
Small organic molecule
Emp. Form.:
C22H22N2O2S2
Mol. Mass.:
410.552
SMILES:
CC#Cc1ccc2sc3ccc(cc3c2c1)[C@]1(C)CS(=O)(=O)C(C)(C)C(=N)N1
: