Target
Cathepsin D
Ligand
BDBM476694
Substrate
Meas. Tech.
Activity Assay
IC50
3900±n/a nM
Citation
 Cherukury, MLin, HYu, SCPhang, RRajan, YCTang-Liu, DDWhite, ADMalone, TBeresis, R Compounds and their use as BACE1 inhibitors US Patent  US10870635 Publication Date 12/22/2020 
Target
Name:
Cathepsin D
Synonyms:
CATD_HUMAN CTSD Cathepsin D heavy chain Cathepsin D precursor
Type:
Enzyme
Mol. Mass.:
44551.72
Organism:
Homo sapiens (Human)
Description:
Human proCathepsin D (SwissProt accession number P07339) was expressed in Sf9 cells, purified, and autoactivated.
Residue:
412
  
Inhibitor
Name:
BDBM476694
Synonyms:
(S)-6-(3-Chloro-8-(prop-1-yn-1-yl) dibenzo[b,d]thiophen-2-yl)-2-imino-3,6- dimethyltetrahydropyrimidin-4(1H)-one | US10870635, Example 71
Type:
Small organic molecule
Emp. Form.:
C21H18ClN3OS
Mol. Mass.:
395.905
SMILES:
CC#Cc1ccc2sc3cc(Cl)c(cc3c2c1)[C@]1(C)CC(=O)N(C)C(=N)N1
: