Target
Protein mono-ADP-ribosyltransferase TIPARP
Ligand
BDBM431558
Substrate
Meas. Tech.
Enzymatic Assay
IC50
<100±n/a nM
Citation
 Vasbinder, MMSchenkel, LBSwinger, KKKuntz, KW Pyridazinones as PARP7 inhibitors US Patent  US10870641 Publication Date 12/22/2020 
Target
Name:
Protein mono-ADP-ribosyltransferase TIPARP
Synonyms:
ADP-ribosyltransferase diphtheria toxin-like 14 PARP-7 PARPT_HUMAN TCDD-inducible poly [ADP-ribose] polymerase | TIPARP
Type:
Protein
Mol. Mass.:
76228.44
Organism:
Human
Description:
Q7Z3E1
Residue:
657
  
Inhibitor
Name:
BDBM431558
Synonyms:
5-[(2-[3-[4-(5-Chloropyrimidin-2-yl)piperazin-1-yl]-3-oxopropoxy]ethyl)amino]-4-(trifluoromethyl)-2,3-dihydropyridazin-3-one US10870641, Example 503 | US11014913, Example 503
Type:
Small organic molecule
Emp. Form.:
C18H21ClF3N7O3
Mol. Mass.:
475.853
SMILES:
FC(F)(F)c1c(NCCOCCC(=O)N2CCN(CC2)c2ncc(Cl)cn2)cn[nH]c1=O
: