Target
CDK-activating kinase assembly factor MAT1/Cyclin-H/Cyclin-dependent kinase 7
Ligand
BDBM476729
Substrate
Meas. Tech.
Inhibition of Kinase Activity
IC50
<100±n/a nM
Citation
 Gray, NSLiang, YZhang, TKwiatkowski, NP Inhibitors of cyclin-dependent kinase 7 (CDK7) US Patent  US10870651 Publication Date 12/22/2020 
Target
Name:
CDK-activating kinase assembly factor MAT1/Cyclin-H/Cyclin-dependent kinase 7
Synonyms:
CDK-activating kinase assembly factor MAT1/Cyclin H/Cyclin-dependent kinase 7 | CDK7/Cyclin H/MNAT1
Type:
Protein
Mol. Mass.:
Description:
Components:
This complex has 3 components.
Component 1
Name:
Cyclin-dependent kinase 7
Synonyms:
39 kDa protein kinase CAK1 CDK-activating kinase 1 (CAK) CDK7_HUMAN Cell division protein kinase 7 Cyclin-dependent kinase 7 (CDK7/cyclin H) P39 Mo15 TFIIH basal transcription factor complex kinase subunit
Type:
Enzyme Subunit
Mol. Mass.:
39047.01
Organism:
Homo sapiens (Human)
Description:
Residue:
346
  
Component 2
Name:
Cyclin-H
Synonyms:
CCNH Cyclin H p34 | p37
Type:
Enzyme Subunit
Mol. Mass.:
37646.05
Organism:
Homo sapiens (Human)
Description:
Residue:
323
  
Component 3
Name:
CDK-activating kinase assembly factor MAT1
Synonyms:
CAP35 Cyclin-G1-interacting protein MAT1_HUMAN Menage a trois RING finger protein MAT1 p35 | p36
Type:
Enzyme
Mol. Mass.:
35820.03
Organism:
Homo sapiens (Human)
Description:
P51948
Residue:
309
  
Inhibitor
Name:
BDBM476729
Synonyms:
US10870651, Compound 117
Type:
Small organic molecule
Emp. Form.:
C34H44N8O3
Mol. Mass.:
612.765
SMILES:
CN(C)C[C@@H](NC(=O)N1Cc2c(N[C@@H]3CCC[C@@H](C3)NC(=O)c3ccc(NC(=O)C=C)cc3)n[nH]c2C1(C)C)c1ccccc1
: