Target
D(3) dopamine receptor
Ligand
BDBM476759
Substrate
Meas. Tech.
Binding Assay
Ki
0.064±n/a nM
Citation
 Tobinaga, HMasuda, KInagaki, MYonehara, MMasuda, M Nitrogen-containing condensed ring compounds having dopamine D3 antagonistic effect US Patent  US10870660 Publication Date 12/22/2020 
Target
Name:
D(3) dopamine receptor
Synonyms:
DOPAMINE D3 DRD3_HUMAN Dopamine D3 receptor (D3) Dopamine receptor Dopamine receptor D3
Type:
Mol. Mass.:
44243.43
Organism:
Homo sapiens (Human)
Description:
Residue:
400
  
Inhibitor
Name:
BDBM476759
Synonyms:
US10870660, Compound III-027 | US11345716, Compound III-027
Type:
Small organic molecule
Emp. Form.:
C29H37F2N5O2
Mol. Mass.:
525.6332
SMILES:
Cn1cc2c(cccc2n1)C(=O)N[C@H]1CC[C@H](CCN2CCc3ccc(OCC(C)(F)F)nc3CC2)CC1
: