Target
D(3) dopamine receptor
Ligand
BDBM476791
Substrate
Meas. Tech.
Binding Assay
Ki
0.160±n/a nM
Citation
 Tobinaga, HMasuda, KInagaki, MYonehara, MMasuda, M Nitrogen-containing condensed ring compounds having dopamine D3 antagonistic effect US Patent  US10870660 Publication Date 12/22/2020 
Target
Name:
D(3) dopamine receptor
Synonyms:
DOPAMINE D3 DRD3_HUMAN Dopamine D3 receptor (D3) Dopamine receptor Dopamine receptor D3
Type:
Mol. Mass.:
44243.43
Organism:
Homo sapiens (Human)
Description:
Residue:
400
  
Inhibitor
Name:
BDBM476791
Synonyms:
US10870660, Compound III-228 | US11345716, Compound III-228
Type:
Small organic molecule
Emp. Form.:
C27H32F3N5O3
Mol. Mass.:
531.5699
SMILES:
Cc1cc2c(cccn2n1)C(=O)N[C@H]1CC[C@H](CCN2CCc3ccc(OCC(F)(F)F)nc3CC2)OC1
: