Target
D(3) dopamine receptor
Ligand
BDBM476866
Substrate
Meas. Tech.
Binding Assay
Ki
0.067±n/a nM
Citation
 Tobinaga, HMasuda, KInagaki, MYonehara, MMasuda, M Nitrogen-containing condensed ring compounds having dopamine D3 antagonistic effect US Patent  US10870660 Publication Date 12/22/2020 
Target
Name:
D(3) dopamine receptor
Synonyms:
DOPAMINE D3 DRD3_HUMAN Dopamine D3 receptor (D3) Dopamine receptor Dopamine receptor D3
Type:
Mol. Mass.:
44243.43
Organism:
Homo sapiens (Human)
Description:
Residue:
400
  
Inhibitor
Name:
BDBM476866
Synonyms:
US10870660, Compound II-053 | US11345716, Compound II-053
Type:
Small organic molecule
Emp. Form.:
C23H31F3N4O2S2
Mol. Mass.:
516.643
SMILES:
Cc1ncc(CC(=O)N[C@H]2CC[C@H](CCN3CCc4nc(OCC(F)(F)F)sc4CC3)CC2)s1
: