Target
D(3) dopamine receptor
Ligand
BDBM476869
Substrate
Meas. Tech.
Binding Assay
Ki
0.095±n/a nM
Citation
 Tobinaga, HMasuda, KInagaki, MYonehara, MMasuda, M Nitrogen-containing condensed ring compounds having dopamine D3 antagonistic effect US Patent  US10870660 Publication Date 12/22/2020 
Target
Name:
D(3) dopamine receptor
Synonyms:
DOPAMINE D3 DRD3_HUMAN Dopamine D3 receptor (D3) Dopamine receptor Dopamine receptor D3
Type:
Mol. Mass.:
44243.43
Organism:
Homo sapiens (Human)
Description:
Residue:
400
  
Inhibitor
Name:
BDBM476869
Synonyms:
US10870660, Compound II-077 | US11345716, Compound II-077
Type:
Small organic molecule
Emp. Form.:
C25H33F3N4O4
Mol. Mass.:
510.5491
SMILES:
COc1cc(CC(=O)N[C@H]2CC[C@H](CCN3CCc4ccc(OCC(F)(F)F)nc4CC3)CC2)on1
: