Target
Programmed cell death 1 ligand/protein 1
Ligand
BDBM474491
Substrate
Meas. Tech.
Inhibitory Activity Assay
IC50
42.5±n/a nM
Citation
 Feng, ZChen, XYang, YZhou, CLai, FJi, MJin, XXue, NZheng, YChen, HLi, L Phenylate derivative, preparation method therefor, and pharmaceutical composition and uses thereof US Patent  US10882833 Publication Date 1/5/2021 
Target
Name:
Programmed cell death 1 ligand/protein 1
Synonyms:
PD-1/PD-L1 | Programmed cell death protein 1/Programmed cell death 1 ligand 1
Type:
Protein
Mol. Mass.:
Description:
Components:
This complex has 2 components.
Component 1
Name:
Programmed cell death protein 1
Synonyms:
CD_antigen=CD279 PDCD1 Programmed cell death protein 1 hPD-1
Type:
PROTEIN
Mol. Mass.:
31650.07
Organism:
Homo sapiens
Description:
ChEMBL_108437
Residue:
288
  
Component 2
Name:
Programmed cell death 1 ligand 1
Synonyms:
B7 homolog 1 B7H1 CD274 PD-L1 PDCD1 ligand 1 PDCD1LG1 Programmed cell death 1 ligand 1 | Programmed death ligand 1
Type:
PROTEIN
Mol. Mass.:
33278.49
Organism:
Homo sapiens (Human)
Description:
ChEMBL_109807
Residue:
290
  
Inhibitor
Name:
BDBM474491
Synonyms:
N-(4-(2-bromo-3-phenylbenzyloxy)-5-chloro-2-(N,N-dimethylcarbamoylmethylcarbamoylmethoxy)benzyl)serine | US10882833, Example 6
Type:
Small organic molecule
Emp. Form.:
C27H28BrClN2O6
Mol. Mass.:
591.878
SMILES:
CN(C)C(=O)COc1cc(OCc2cccc(c2Br)-c2ccccc2)c(Cl)cc1CNC(CO)C(O)=O
: